view slides/2018/04/29/memo.txt @ 33:2eac67c0d7da fix

auto-Update generated slides by script
author Takahiro SHIMIZU <anatofuz@cr.ie.u-ryukyu.ac.jp>
date Tue, 01 May 2018 09:25:17 +0900
parents
children
line wrap: on
line source

同様のことをローカルでしようとするとライブラリ関連でコケる

compiling src/jit/x64/arch.o
compiling 3rdparty/libuv/src/unix/darwin-proctitle.o
In file included from /System/Library/Frameworks/Security.framework/Headers/AuthSession.h:32:0,
                 from /System/Library/Frameworks/Security.framework/Headers/Security.h:43,
                 from /System/Library/Frameworks/CoreServices.framework/Frameworks/OSServices.framework/Headers/CSIdentity.h:43,
                 from /System/Library/Frameworks/CoreServices.framework/Frameworks/OSServices.framework/Headers/OSServices.h:27,
                 from /System/Library/Frameworks/CoreServices.framework/Frameworks/LaunchServices.framework/Headers/IconsCore.h:23,
                 from /System/Library/Frameworks/CoreServices.framework/Frameworks/LaunchServices.framework/Headers/LaunchServices.h:22,
                 from /System/Library/Frameworks/CoreServices.framework/Headers/CoreServices.h:39,
                 from /System/Library/Frameworks/ApplicationServices.framework/Headers/ApplicationServices.h:23,
                 from 3rdparty/libuv/src/unix/darwin-proctitle.c:33:
/System/Library/Frameworks/Security.framework/Headers/Authorization.h:193:7: error: variably modified 'bytes' at file scope
  char bytes[kAuthorizationExternalFormLength];
       ^~~~~
In file included from /System/Library/Frameworks/CoreGraphics.framework/Headers/CGContext.h:18:0,
                 from /System/Library/Frameworks/CoreGraphics.framework/Headers/CGBitmapContext.h:9,
                 from /System/Library/Frameworks/CoreGraphics.framework/Headers/CoreGraphics.h:11,
                 from /System/Library/Frameworks/ApplicationServices.framework/Headers/ApplicationServices.h:35,
                 from 3rdparty/libuv/src/unix/darwin-proctitle.c:33:
/System/Library/Frameworks/CoreGraphics.framework/Headers/CGFont.h:53:40: error: initializer element is not constant
 static const CGFontIndex kCGGlyphMax = kCGFontIndexMax;
                                        ^~~~~~~~~~~~~~~
In file included from /System/Library/Frameworks/CoreGraphics.framework/Headers/CGContext.h:21:0,
                 from /System/Library/Frameworks/CoreGraphics.framework/Headers/CGBitmapContext.h:9,
                 from /System/Library/Frameworks/CoreGraphics.framework/Headers/CoreGraphics.h:11,
                 from /System/Library/Frameworks/ApplicationServices.framework/Headers/ApplicationServices.h:35,
                 from 3rdparty/libuv/src/unix/darwin-proctitle.c:33:
/System/Library/Frameworks/CoreGraphics.framework/Headers/CGPath.h:391:15: error: expected identifier or '(' before '^' token
 typedef void (^CGPathApplyBlock)(const CGPathElement * element);
               ^
/System/Library/Frameworks/CoreGraphics.framework/Headers/CGPath.h:393:53: error: unknown type name 'CGPathApplyBlock'
 CG_EXTERN void CGPathApplyWithBlock(CGPathRef path, CGPathApplyBlock CF_NOESCAPE block)
                                                     ^~~~~~~~~~~~~~~~
make: *** [3rdparty/libuv/src/unix/darwin-proctitle.o] Error 1
>>> elapsed time 1m45s